BDBM50123791 3-[(4-Aminomethyl-phenylcarbamoyl)-methyl]-7-chloro-1,3,4,5-tetrahydro-benzo[cd]indole-2-carboxylic acid::CHEMBL162693
SMILES NCc1ccc(NC(=O)C[C@@H]2CCc3cc(Cl)cc4[nH]c(C(O)=O)c2c34)cc1
InChI Key InChIKey=YJGFPBHTLUTDBZ-ZDUSSCGKSA-N
Data  1 IC50
  Tab Delimited (TSV)   2D SDfile   Computed 3D by Vconf -m prep SDfile
Find this compound or compounds like it in BindingDB:
Activity Spreadsheet -- Enzyme Inhibition Constant Data from BindingDB
Found 1 hit for monomerid = 50123791
TargetGlutamate receptor ionotropic, NMDA 1(RAT)
Sumitomo Pharmaceuticals
Curated by ChEMBL
LigandPNGBDBM50123791(3-[(4-Aminomethyl-phenylcarbamoyl)-methyl]-7-chlor...)
Affinity DataIC50:  18nM. Assay description: Affinity for glycine site of N-methyl-D-aspartate glutamate receptor determined by displacement of tritium labeled selective glycine antagonist [3H]-...
In DepthDetails ArticlePubMed