BDBM50124005 CHEMBL440196::N-(3-Cyclopropylmethyl-6,11-dimethyl-1,2,3,4,5,6-hexahydro-2,6-methano-benzo[d]azocin-8-yl)-N',N'-dimethyl-benzene-1,4-diamine
SMILES C[C@H]1C2Cc3ccc(Nc4ccc(cc4)N(C)C)cc3[C@@]1(C)CCN2CC1CC1
InChI Key InChIKey=MUBKMIVBISNFDP-XLXODUMSSA-N
Data  3 KI
  Tab Delimited (TSV)   2D SDfile   Computed 3D by Vconf -m prep SDfile
Find this compound or compounds like it in BindingDB:
Activity Spreadsheet -- Enzyme Inhibition Constant Data from BindingDB
Found 3 hits for monomerid = 50124005
TargetKappa-type opioid receptor(Cavia porcellus (domestic guinea pig))
Rensselaer Polytechnic Institute
Curated by ChEMBL
LigandPNGBDBM50124005(CHEMBL440196 | N-(3-Cyclopropylmethyl-6,11-dimethy...)
Affinity DataKi:  8.80nM. Assay description: Binding affinity towards Opioid receptor kappa 1 from guinea pig brain using [3H]U69,593 as radioligand
In DepthDetails ArticlePubMed
TargetMu-type opioid receptor(GUINEA PIG)
Rensselaer Polytechnic Institute
Curated by ChEMBL
LigandPNGBDBM50124005(CHEMBL440196 | N-(3-Cyclopropylmethyl-6,11-dimethy...)
Affinity DataKi:  70nM. Assay description: Binding affinity towards Opioid receptor mu 1 from guinea pig brain using [3H]DAMGO as radioligand
In DepthDetails ArticlePubMed
TargetDelta-type opioid receptor(Homo sapiens (Human))
Rensselaer Polytechnic Institute
Curated by ChEMBL
LigandPNGBDBM50124005(CHEMBL440196 | N-(3-Cyclopropylmethyl-6,11-dimethy...)
Affinity DataKi:  75nM. Assay description: Binding affinity towards Opioid receptor delta 1 from guinea pig brain using [3H]naltrindole as radioligand
In DepthDetails ArticlePubMed