BDBM50124091 2-[6-Methyl-2-oxo-3-(2-pyridin-2-yl-ethylamino)-2H-pyrazin-1-yl]-N-(1H-pyrrolo[3,2-b]pyridin-5-ylmethyl)-acetamide::CHEMBL164333
SMILES Cc1cnc(NCCc2ccccn2)c(=O)n1CC(=O)NCc1ccc2[nH]ccc2n1
InChI Key InChIKey=YXJCXONTCJFUIY-UHFFFAOYSA-N
Data  2 KI
  Tab Delimited (TSV)   2D SDfile   Computed 3D by Vconf -m prep SDfile
Find this compound or compounds like it in BindingDB:
Activity Spreadsheet -- Enzyme Inhibition Constant Data from BindingDB
Found 2 hits for monomerid = 50124091
TargetProthrombin(Homo sapiens (Human))
Merck Research Laboratories
Curated by ChEMBL
LigandPNGBDBM50124091(2-[6-Methyl-2-oxo-3-(2-pyridin-2-yl-ethylamino)-2H...)
Affinity DataKi:  3.20nM. Assay description: Inhibition of Thrombin
In DepthDetails ArticlePubMed
TargetSerine protease 1(Homo sapiens (Human))
Merck Research Laboratories
Curated by ChEMBL
LigandPNGBDBM50124091(2-[6-Methyl-2-oxo-3-(2-pyridin-2-yl-ethylamino)-2H...)
Affinity DataKi: >1.00E+6nM. Assay description: Inhibition of Trypsin
In DepthDetails ArticlePubMed