BDBM50124093 CHEMBL355730::N-(1H-Indol-5-ylmethyl)-2-[6-methyl-2-oxo-3-(2-pyridin-2-yl-ethylamino)-2H-pyrazin-1-yl]-acetamide
SMILES Cc1cnc(NCCc2ccccn2)c(=O)n1CC(=O)NCc1ccc2[nH]ccc2c1
InChI Key InChIKey=MDTMQDZZOREKQA-UHFFFAOYSA-N
Data  4 KI
  Tab Delimited (TSV)   2D SDfile   Computed 3D by Vconf -m prep SDfile
Find this compound or compounds like it in BindingDB:
Activity Spreadsheet -- Enzyme Inhibition Constant Data from BindingDB
Found 4 hits for monomerid = 50124093
TargetProthrombin(Homo sapiens (Human))
Merck Research Laboratories
Curated by ChEMBL
LigandPNGBDBM50124093(CHEMBL355730 | N-(1H-Indol-5-ylmethyl)-2-[6-methyl...)
Affinity DataKi:  1.60nM. Assay description: Inhibition of Thrombin
In DepthDetails ArticlePubMed
TargetProthrombin(Homo sapiens (Human))
Merck Research Laboratories
Curated by ChEMBL
LigandPNGBDBM50124093(CHEMBL355730 | N-(1H-Indol-5-ylmethyl)-2-[6-methyl...)
Affinity DataKi:  1.60nM. Assay description: Inhibition of human thrombin assessed as release of p-nitroanilide from chromogenic substrate
In DepthDetails ArticlePubMed
TargetTrypsin(Homo sapiens (Human))
Hefei University Of Technology
Curated by ChEMBL
LigandPNGBDBM50124093(CHEMBL355730 | N-(1H-Indol-5-ylmethyl)-2-[6-methyl...)
Affinity DataKi:  2.90E+5nM. Assay description: Inhibition of human trypsin assessed as release of p-nitroanilide from chromogenic substrate
In DepthDetails ArticlePubMed
TargetSerine protease 1(Homo sapiens (Human))
Merck Research Laboratories
Curated by ChEMBL
LigandPNGBDBM50124093(CHEMBL355730 | N-(1H-Indol-5-ylmethyl)-2-[6-methyl...)
Affinity DataKi:  2.90E+5nM. Assay description: Inhibition of Trypsin
In DepthDetails ArticlePubMed