BDBM50124980 CHEMBL351052::N-[(R)-4-Guanidino-1-(thiazole-2-carbonyl)-butyl]-2-(2-oxo-piperazin-1-yl)-acetamide
SMILES NC(=N)NCCC[C@@H](NC(=O)CN1CCNCC1=O)C(=O)c1nccs1
InChI Key InChIKey=CUDXSHIKWVJPHQ-SNVBAGLBSA-N
Data  2 IC50
  Tab Delimited (TSV)   2D SDfile   Computed 3D by Vconf -m prep SDfile
Find this compound or compounds like it in BindingDB:
Activity Spreadsheet -- Enzyme Inhibition Constant Data from BindingDB
Found 2 hits for monomerid = 50124980
TargetCoagulation factor X(Homo sapiens (Human))
Millennium Pharmaceuticals
Curated by ChEMBL
LigandPNGBDBM50124980(CHEMBL351052 | N-[(R)-4-Guanidino-1-(thiazole-2-ca...)
Affinity DataIC50:  2.20E+4nM. Assay description: In vitro inhibitory activity against factor Xa
In DepthDetails ArticlePubMed
TargetProthrombin(Homo sapiens (Human))
Millennium Pharmaceuticals
Curated by ChEMBL
LigandPNGBDBM50124980(CHEMBL351052 | N-[(R)-4-Guanidino-1-(thiazole-2-ca...)
Affinity DataIC50:  2.20E+5nM. Assay description: In vitro inhibitory activity against serine protease thrombin
In DepthDetails ArticlePubMed