BDBM50124996 CHEMBL265997::N-[4-Guanidino-1-(thiazole-2-carbonyl)-butyl]-2-[2-oxo-4-((E)-2-phenyl-ethenesulfonyl)-piperazin-1-yl]-acetamide
SMILES NC(=N)NCCCC(NC(=O)CN1CCN(CC1=O)S(=O)(=O)C=Cc1ccccc1)C(=O)c1nccs1
InChI Key InChIKey=FDTXALAYOAEXNF-UHFFFAOYSA-N
Data  2 IC50
  Tab Delimited (TSV)   2D SDfile   Computed 3D by Vconf -m prep SDfile
Find this compound or compounds like it in BindingDB:
Activity Spreadsheet -- Enzyme Inhibition Constant Data from BindingDB
Found 2 hits for monomerid = 50124996
TargetCoagulation factor X(Homo sapiens (Human))
Millennium Pharmaceuticals
Curated by ChEMBL
LigandPNGBDBM50124996(CHEMBL265997 | N-[4-Guanidino-1-(thiazole-2-carbon...)
Affinity DataIC50:  13nM. Assay description: In vitro inhibitory activity against factor Xa
In DepthDetails ArticlePubMed
TargetProthrombin(Homo sapiens (Human))
Millennium Pharmaceuticals
Curated by ChEMBL
LigandPNGBDBM50124996(CHEMBL265997 | N-[4-Guanidino-1-(thiazole-2-carbon...)
Affinity DataIC50:  7.00E+3nM. Assay description: In vitro inhibitory activity against serine protease thrombin
In DepthDetails ArticlePubMed