BDBM50124999 CHEMBL163799::N-[4-Guanidino-1-(thiazole-2-carbonyl)-butyl]-2-[4-(naphthalene-1-sulfonyl)-2-oxo-piperazin-1-yl]-acetamide
SMILES NC(=N)NCCCC(NC(=O)CN1CCN(CC1=O)S(=O)(=O)c1cccc2ccccc12)C(=O)c1nccs1
InChI Key InChIKey=FEAFEDHUTJTGEV-UHFFFAOYSA-N
Data  2 IC50
  Tab Delimited (TSV)   2D SDfile   Computed 3D by Vconf -m prep SDfile
Find this compound or compounds like it in BindingDB:
Activity Spreadsheet -- Enzyme Inhibition Constant Data from BindingDB
Found 2 hits for monomerid = 50124999
TargetProthrombin(Homo sapiens (Human))
Millennium Pharmaceuticals
Curated by ChEMBL
LigandPNGBDBM50124999(CHEMBL163799 | N-[4-Guanidino-1-(thiazole-2-carbon...)
Affinity DataIC50:  118nM. Assay description: In vitro inhibitory activity against serine protease thrombin
In DepthDetails ArticlePubMed
TargetCoagulation factor X(Homo sapiens (Human))
Millennium Pharmaceuticals
Curated by ChEMBL
LigandPNGBDBM50124999(CHEMBL163799 | N-[4-Guanidino-1-(thiazole-2-carbon...)
Affinity DataIC50:  2nM. Assay description: In vitro inhibitory activity against factor Xa
In DepthDetails ArticlePubMed