BDBM50125003 CHEMBL163809::N-[4-Guanidino-1-(thiazole-2-carbonyl)-butyl]-2-[4-(4-nitro-benzenesulfonyl)-2-oxo-piperazin-1-yl]-acetamide
SMILES NC([NH-])=[NH+]CCCC(NC(=O)CN1CCN(CC1=O)S(=O)(=O)c1ccc(cc1)[N+]([O-])=O)C(=O)c1nccs1
InChI Key InChIKey=YVZHQFZAGWMZLA-UHFFFAOYSA-N
Data  2 IC50
  Tab Delimited (TSV)   2D SDfile   Computed 3D by Vconf -m prep SDfile
Find this compound or compounds like it in BindingDB:
Activity Spreadsheet -- Enzyme Inhibition Constant Data from BindingDB
Found 2 hits for monomerid = 50125003
TargetCoagulation factor X(Homo sapiens (Human))
Millennium Pharmaceuticals
Curated by ChEMBL
LigandPNGBDBM50125003(CHEMBL163809 | N-[4-Guanidino-1-(thiazole-2-carbon...)
Affinity DataIC50:  6nM. Assay description: In vitro inhibitory activity against factor Xa
In DepthDetails ArticlePubMed
TargetProthrombin(Homo sapiens (Human))
Millennium Pharmaceuticals
Curated by ChEMBL
LigandPNGBDBM50125003(CHEMBL163809 | N-[4-Guanidino-1-(thiazole-2-carbon...)
Affinity DataIC50:  3.00E+3nM. Assay description: In vitro inhibitory activity against serine protease thrombin
In DepthDetails ArticlePubMed