BDBM50125016 CHEMBL161881::N-[(R)-4-Guanidino-1-(thiazole-2-carbonyl)-butyl]-2-(7-oxo-4-phenylmethanesulfonyl-[1,4]diazepan-1-yl)-acetamide
SMILES NC(=N)NCCC[C@@H](NC(=O)CN1CCN(CCC1=O)S(=O)(=O)Cc1ccccc1)C(=O)c1nccs1
InChI Key InChIKey=LLMLAEGMCACBLY-GOSISDBHSA-N
Data  2 IC50
  Tab Delimited (TSV)   2D SDfile   Computed 3D by Vconf -m prep SDfile
Find this compound or compounds like it in BindingDB:
Activity Spreadsheet -- Enzyme Inhibition Constant Data from BindingDB
Found 2 hits for monomerid = 50125016
TargetCoagulation factor X(Homo sapiens (Human))
Millennium Pharmaceuticals
Curated by ChEMBL
LigandPNGBDBM50125016(CHEMBL161881 | N-[(R)-4-Guanidino-1-(thiazole-2-ca...)
Affinity DataIC50:  5nM. Assay description: In vitro inhibitory activity against factor Xa
In DepthDetails ArticlePubMed
TargetProthrombin(Homo sapiens (Human))
Millennium Pharmaceuticals
Curated by ChEMBL
LigandPNGBDBM50125016(CHEMBL161881 | N-[(R)-4-Guanidino-1-(thiazole-2-ca...)
Affinity DataIC50:  2.00E+3nM. Assay description: In vitro inhibitory activity against serine protease thrombin
In DepthDetails ArticlePubMed