BDBM50125017 CHEMBL350976::N-((R)-5-Guanidino-2-phenylmethanesulfonylamino-pentanoyl)-2-[(R)-4-guanidino-1-(thiazole-2-carbonyl)-butylamino]-acetamide
SMILES NC(=N)NCCC[C@@H](NCC(=O)NC(=O)[C@@H](CCCNC(N)=N)NS(=O)(=O)Cc1ccccc1)C(=O)c1nccs1
InChI Key InChIKey=VZEFMVBIEFMFSZ-QZTJIDSGSA-N
Data  1 KI  1 IC50
  Tab Delimited (TSV)   2D SDfile   Computed 3D by Vconf -m prep SDfile
Find this compound or compounds like it in BindingDB:
Activity Spreadsheet -- Enzyme Inhibition Constant Data from BindingDB
Found 2 hits for monomerid = 50125017
TargetProthrombin(Homo sapiens (Human))
Millennium Pharmaceuticals
Curated by ChEMBL
LigandPNGBDBM50125017(CHEMBL350976 | N-((R)-5-Guanidino-2-phenylmethanes...)
Affinity DataKi:  0.650nM. Assay description: In vitro inhibitory activity against serine protease thrombin
In DepthDetails ArticlePubMed
TargetCoagulation factor X(Homo sapiens (Human))
Millennium Pharmaceuticals
Curated by ChEMBL
LigandPNGBDBM50125017(CHEMBL350976 | N-((R)-5-Guanidino-2-phenylmethanes...)
Affinity DataIC50:  13nM. Assay description: In vitro inhibitory activity against factor Xa
In DepthDetails ArticlePubMed