BDBM50125026 3-((R)-4-{[(S)-4-Guanidino-1-(thiazole-2-carbonyl)-butylcarbamoyl]-methyl}-3-oxo-1-phenylmethanesulfonyl-piperazin-2-yl)-propionic acid::CHEMBL349618
SMILES NC(=N)NCCC[C@H](NC(=O)CN1CCN([C@H](CCC(O)=O)C1=O)S(=O)(=O)Cc1ccccc1)C(=O)c1nccs1
InChI Key InChIKey=SYSYKLZQEKYYOI-RBUKOAKNSA-N
Data  2 IC50
  Tab Delimited (TSV)   2D SDfile   Computed 3D by Vconf -m prep SDfile
Find this compound or compounds like it in BindingDB:
Activity Spreadsheet -- Enzyme Inhibition Constant Data from BindingDB
Found 2 hits for monomerid = 50125026
TargetCoagulation factor X(Homo sapiens (Human))
Millennium Pharmaceuticals
Curated by ChEMBL
LigandPNGBDBM50125026(3-((R)-4-{[(S)-4-Guanidino-1-(thiazole-2-carbonyl)...)
Affinity DataIC50:  4nM. Assay description: In vitro inhibitory activity against factor Xa
In DepthDetails ArticlePubMed
TargetProthrombin(Homo sapiens (Human))
Millennium Pharmaceuticals
Curated by ChEMBL
LigandPNGBDBM50125026(3-((R)-4-{[(S)-4-Guanidino-1-(thiazole-2-carbonyl)...)
Affinity DataIC50:  5.00E+3nM. Assay description: In vitro inhibitory activity against serine protease thrombin
In DepthDetails ArticlePubMed