BDBM50125030 2-((R)-4-(benzylsulfonyl)-3-(3-guanidinopropyl)-2-oxopiperazin-1-yl)-N-((S)-5-guanidino-1-oxo-1-(thiazol-2-yl)pentan-2-yl)acetamide::2-[(R)-3-(3-Guanidino-propyl)-2-oxo-4-phenylmethanesulfonyl-piperazin-1-yl]-N-[(S)-4-guanidino-1-(thiazole-2-carbonyl)-butyl]-acetamide::CHEMBL350514
SMILES NC(=N)NCCC[C@H](NC(=O)CN1CCN([C@H](CCCNC(N)=N)C1=O)S(=O)(=O)Cc1ccccc1)C(=O)c1nccs1
InChI Key InChIKey=ABWTYHKQMAEDCC-VQTJNVASSA-N
Data  4 IC50
  Tab Delimited (TSV)   2D SDfile   Computed 3D by Vconf -m prep SDfile
Find this compound or compounds like it in BindingDB:
Activity Spreadsheet -- Enzyme Inhibition Constant Data from BindingDB
Found 4 hits for monomerid = 50125030
TargetCoagulation factor X(Homo sapiens (Human))
Millennium Pharmaceuticals
Curated by ChEMBL
LigandPNGBDBM50125030(2-((R)-4-(benzylsulfonyl)-3-(3-guanidinopropyl)-2-...)
Affinity DataIC50:  13nM. Assay description: In vitro inhibitory activity against factor Xa
In DepthDetails ArticlePubMed
TargetCoagulation factor X(Homo sapiens (Human))
Millennium Pharmaceuticals
Curated by ChEMBL
LigandPNGBDBM50125030(2-((R)-4-(benzylsulfonyl)-3-(3-guanidinopropyl)-2-...)
Affinity DataIC50:  13nM. Assay description: Inhibition of human factor 10a
In DepthDetails ArticlePubMed
TargetProthrombin(Homo sapiens (Human))
Johnson & Johnson Pharmaceutical Research & Development
Curated by ChEMBL
LigandPNGBDBM50125030(2-((R)-4-(benzylsulfonyl)-3-(3-guanidinopropyl)-2-...)
Affinity DataIC50:  3.00E+3nM. Assay description: Inhibition of human alpha-thrombin
In DepthDetails ArticlePubMed
TargetProthrombin(Homo sapiens (Human))
Johnson & Johnson Pharmaceutical Research & Development
Curated by ChEMBL
LigandPNGBDBM50125030(2-((R)-4-(benzylsulfonyl)-3-(3-guanidinopropyl)-2-...)
Affinity DataIC50:  3.00E+3nM. Assay description: In vitro inhibitory activity against serine protease thrombin
In DepthDetails ArticlePubMed