BDBM50126170 CHEMBL3629678
SMILES CCCCCCCCCC(=O)N[C@@H](Cc1ccccc1)C(=O)N[C@H]1\C=C\CCNC(=O)\C=C\[C@@H](NC1=O)C(C)C
InChI Key InChIKey=DEYSFEQWDNFNBI-AXYLIBAESA-N
Data  1 KI
  Tab Delimited (TSV)   2D SDfile   Computed 3D by Vconf -m prep SDfile
Find this compound or compounds like it in BindingDB:
Activity Spreadsheet -- Enzyme Inhibition Constant Data from BindingDB
Found 1 hit for monomerid = 50126170
TargetProteasome subunit beta type-5(Homo sapiens (Human))
Hokkaido University
Curated by ChEMBL
LigandPNGBDBM50126170(CHEMBL3629678)
Affinity DataKi:  0.140nM. Assay description: Inhibition of proteasome beta-5 (unknown origin)
In DepthDetails ArticlePubMed