BDBM50126312 2-{6-Chloro-3-[2,2-difluoro-2-(1-oxy-pyridin-2-yl)-ethylamino]-2-oxo-2H-pyrazin-1-yl}-N-(2-methyl-benzyl)-acetamide::CHEMBL285796
SMILES Cc1ccccc1CNC(=O)Cn1c(Cl)cnc(NCC(F)(F)c2cccc[n+]2[O-])c1=O
InChI Key InChIKey=JIHUQKBMQXFCPZ-UHFFFAOYSA-N
Data  1 KI
  Tab Delimited (TSV)   2D SDfile   Computed 3D by Vconf -m prep SDfile
Find this compound or compounds like it in BindingDB:
Activity Spreadsheet -- Enzyme Inhibition Constant Data from BindingDB
Found 1 hit for monomerid = 50126312
TargetProthrombin(Homo sapiens (Human))
Merck Research Laboratories
Curated by ChEMBL
LigandPNGBDBM50126312(2-{6-Chloro-3-[2,2-difluoro-2-(1-oxy-pyridin-2-yl)...)
Affinity DataKi:  6.30nM. Assay description: Inhibitory activity against human thrombin
In DepthDetails ArticlePubMed