BDBM50129120 7-Methoxy-6-oxazol-4-yl-2-phenyl-1H-quinolin-4-one::CHEMBL65738
SMILES COc1cc2nc(cc(O)c2cc1-c1cocn1)-c1ccccc1
InChI Key InChIKey=BLGPRCPRJVHVMA-UHFFFAOYSA-N
Data  1 IC50
  Tab Delimited (TSV)   2D SDfile   Computed 3D by Vconf -m prep SDfile
Find this compound or compounds like it in BindingDB:
Activity Spreadsheet -- Enzyme Inhibition Constant Data from BindingDB
Found 1 hit for monomerid = 50129120
TargetInosine-5'-monophosphate dehydrogenase 2(Homo sapiens (Human))
Bristol-Myers Squibb Pharmaceutical Research Institute
Curated by ChEMBL
LigandPNGBDBM50129120(7-Methoxy-6-oxazol-4-yl-2-phenyl-1H-quinolin-4-one...)
Affinity DataIC50:  210nM. Assay description: Inhibition of inosine-5'-monophosphate dehydrogenase 2.
In DepthDetails ArticlePubMed