BDBM50129792 2-(4-Dimethylamino-phenyl)-benzothiazol-6-ol::CHEMBL91449
SMILES CN(C)c1ccc(cc1)-c1nc2ccc(O)cc2s1
InChI Key InChIKey=WDXCWXZECJHKRF-UHFFFAOYSA-N
Data  1 KI
  Tab Delimited (TSV)   2D SDfile   Computed 3D by Vconf -m prep SDfile
Find this compound or compounds like it in BindingDB:
Activity Spreadsheet -- Enzyme Inhibition Constant Data from BindingDB
Found 1 hit for monomerid = 50129792
TargetAmyloid-beta precursor protein(Homo sapiens (Human))
University Of Pittsburgh
Curated by ChEMBL
LigandPNGBDBM50129792(2-(4-Dimethylamino-phenyl)-benzothiazol-6-ol | CHE...)
Affinity DataKi:  4.40nM. Assay description: Binding affinity for Amyloid beta 1-40 aggregates in competition with [N-methyl-3H] BTA-1.
In DepthDetails ArticlePubMed