BDBM50130012 CHEMBL75185::N-{4-[Acetyl-(4-guanidino-butyl)-amino]-cyclohexyl}-N-[2-(1H-indol-3-yl)-ethyl]-acetamide
SMILES CC(=O)N(CCCCNC(N)=N)C1CCC(CC1)N(CCc1c[nH]c2ccccc12)C(C)=O
InChI Key InChIKey=HIPKOCIWMSCDNI-UHFFFAOYSA-N
Data  3 IC50
  Tab Delimited (TSV)   2D SDfile   Computed 3D by Vconf -m prep SDfile
Find this compound or compounds like it in BindingDB:
Activity Spreadsheet -- Enzyme Inhibition Constant Data from BindingDB
Found 3 hits for monomerid = 50130012
TargetMelanocortin receptor 3(Homo sapiens (Human))
Amgen
Curated by ChEMBL
LigandPNGBDBM50130012(CHEMBL75185 | N-{4-[Acetyl-(4-guanidino-butyl)-ami...)
Affinity DataIC50: >1.00E+4nM. Assay description: Binding affinity towards human melanocortin 3 receptor (hMC3R) using [125I]NDP-alpha-MSH as radioligand
In DepthDetails ArticlePubMed
TargetMelanocyte-stimulating hormone receptor(Mus musculus)
Amgen
Curated by ChEMBL
LigandPNGBDBM50130012(CHEMBL75185 | N-{4-[Acetyl-(4-guanidino-butyl)-ami...)
Affinity DataIC50: >1.00E+4nM. Assay description: Binding affinity towards mouse Melanocortin 1 receptor (mMC1R) using [125I]NDP-alpha-MSH as radioligand
In DepthDetails ArticlePubMed
TargetMelanocortin receptor 4(Homo sapiens (Human))
Amgen
Curated by ChEMBL
LigandPNGBDBM50130012(CHEMBL75185 | N-{4-[Acetyl-(4-guanidino-butyl)-ami...)
Affinity DataIC50: >1.00E+4nM. Assay description: Binding affinity towards human melanocortin 4 receptor (hMC4R) using [125I]NDP-alpha-MSH as radioligand
In DepthDetails ArticlePubMed