BDBM50130080 7-o-Tolyl-2,3,4,5,11,11a-hexahydro-1H-[1,4]diazepino[1,7-a]indole::CHEMBL76645
SMILES Cc1ccccc1-c1cccc2CC3CCNCCN3c12
InChI Key InChIKey=KGLKDEULNFYNPR-UHFFFAOYSA-N
Data  4 KI
  Tab Delimited (TSV)   2D SDfile   Computed 3D by Vconf -m prep SDfile
Find this compound or compounds like it in BindingDB:
Activity Spreadsheet -- Enzyme Inhibition Constant Data from BindingDB
Found 4 hits for monomerid = 50130080
Target5-hydroxytryptamine receptor 2C(Homo sapiens (Human))
Pharmacia
Curated by ChEMBL
LigandPNGBDBM50130080(7-o-Tolyl-2,3,4,5,11,11a-hexahydro-1H-[1,4]diazepi...)
Affinity DataKi:  39nM. Assay description: Binding affinity against 5-hydroxytryptamine 2A receptor using [125I]-DOI radioligand.
In DepthDetails ArticlePubMed
Target5-hydroxytryptamine receptor 2C(Homo sapiens (Human))
Pharmacia
Curated by ChEMBL
LigandPNGBDBM50130080(7-o-Tolyl-2,3,4,5,11,11a-hexahydro-1H-[1,4]diazepi...)
Affinity DataKi:  39nM. Assay description: Binding affinity against 5-hydroxytryptamine 2C receptor using [125I]-DOI radioligand.
In DepthDetails ArticlePubMed
Target5-hydroxytryptamine receptor 2A(Homo sapiens (Human))
Pharmacia
Curated by ChEMBL
LigandPNGBDBM50130080(7-o-Tolyl-2,3,4,5,11,11a-hexahydro-1H-[1,4]diazepi...)
Affinity DataKi:  136nM. Assay description: Binding affinity against 5-hydroxytryptamine 2C receptor using [125I]-DOI radioligand.
In DepthDetails ArticlePubMed
Target5-hydroxytryptamine receptor 2A(Homo sapiens (Human))
Pharmacia
Curated by ChEMBL
LigandPNGBDBM50130080(7-o-Tolyl-2,3,4,5,11,11a-hexahydro-1H-[1,4]diazepi...)
Affinity DataKi:  136nM. Assay description: Binding affinity against 5-hydroxytryptamine 2A receptor using [125I]-DOI radioligand.
In DepthDetails ArticlePubMed