BDBM50130440 CHEMBL104720::Cyclopropanecarboxylic acid [3-(1-methyl-piperidin-4-yl)-1H-pyrrolo[3,2-b]pyridin-5-yl]-amide
SMILES CN1CCC(CC1)c1c[nH]c2ccc(NC(=O)C3CC3)nc12
InChI Key InChIKey=LVNGFTRMMWFHRF-UHFFFAOYSA-N
Data  4 KI  1 EC50
  Tab Delimited (TSV)   2D SDfile   Computed 3D by Vconf -m prep SDfile
Find this compound or compounds like it in BindingDB:
Activity Spreadsheet -- Enzyme Inhibition Constant Data from BindingDB
Found 5 hits for monomerid = 50130440
Target5-hydroxytryptamine receptor 1F(Homo sapiens (Human))
Eli Lilly
Curated by ChEMBL
LigandPNGBDBM50130440(CHEMBL104720 | Cyclopropanecarboxylic acid [3-(1-m...)
Affinity DataKi:  9.80nM. Assay description: In vitro binding affinity was determined by radioligand binding assay using cell line expressing human 5-hydroxytryptamine 1F receptor
In DepthDetails ArticlePubMed
Target5-hydroxytryptamine receptor 1A(Homo sapiens (Human))
Eli Lilly
Curated by ChEMBL
LigandPNGBDBM50130440(CHEMBL104720 | Cyclopropanecarboxylic acid [3-(1-m...)
Affinity DataKi:  1.40E+3nM. Assay description: In vitro binding affinity of the compound was determined by radioligand binding assay using cell line expressing human 5-hydroxytryptamine 1A recepto...
In DepthDetails ArticlePubMed
Target5-hydroxytryptamine receptor 1B(Homo sapiens (Human))
Eli Lilly
Curated by ChEMBL
LigandPNGBDBM50130440(CHEMBL104720 | Cyclopropanecarboxylic acid [3-(1-m...)
Affinity DataKi:  1.70E+3nM. Assay description: In vitro binding affinity of the compound was determined by radioligand binding assay using cell line expressing human 5-hydroxytryptamine 1B recepto...
In DepthDetails ArticlePubMed
Target5-hydroxytryptamine receptor 1D(Homo sapiens (Human))
Eli Lilly
Curated by ChEMBL
LigandPNGBDBM50130440(CHEMBL104720 | Cyclopropanecarboxylic acid [3-(1-m...)
Affinity DataKi:  1.80E+3nM. Assay description: In vitro binding affinity of the compound was determined by radioligand binding assay using cell line expressing human 5-hydroxytryptamine 1D recepto...
In DepthDetails ArticlePubMed
Target5-hydroxytryptamine receptor 1F(Homo sapiens (Human))
Eli Lilly
Curated by ChEMBL
LigandPNGBDBM50130440(CHEMBL104720 | Cyclopropanecarboxylic acid [3-(1-m...)
Affinity DataEC50:  34nM. Assay description: In vitro effective concentration for stimulation of [35S]-GTP-gammaS, binding in mouse LM(tk-)cells expressing the human 5-hydroxytryptamine 1F recep...
In DepthDetails ArticlePubMed