BDBM50130669 CHEMBL3634614::US10329295, Example 35
SMILES Cn1cc(NC(=O)c2ccc3cnc(N[C@@H]4CCCC[C@@H]4N)nn23)c(n1)C#N
InChI Key InChIKey=HUHRNIHSHWKZQT-QWHCGFSZSA-N
Data  3 IC50
  Tab Delimited (TSV)   2D SDfile   Computed 3D by Vconf -m prep SDfile
Find this compound or compounds like it in BindingDB:
Activity Spreadsheet -- Enzyme Inhibition Constant Data from BindingDB
Found 3 hits for monomerid = 50130669
TargetInterleukin-1 receptor-associated kinase 4(Homo sapiens (Human))
Merck Research Laboratories
Curated by ChEMBL
LigandPNGBDBM50130669(CHEMBL3634614 | US10329295, Example 35)
Affinity DataIC50:  25nM. Assay description: Inhibition of IRAK4 in human PBMC
In DepthDetails ArticlePubMed
TargetInterleukin-1 receptor-associated kinase 4(Homo sapiens (Human))
Merck Research Laboratories
Curated by ChEMBL
LigandPNGBDBM50130669(CHEMBL3634614 | US10329295, Example 35)
Affinity DataIC50:  1nM. Assay description: The kinase activity of IRAK4 is determined by its ability to catalyze the phosphorylation of a fluorescent polypeptide substrate. The extent of phosp...
In DepthDetails US Patent
TargetInterleukin-1 receptor-associated kinase 4(Homo sapiens (Human))
Merck Research Laboratories
Curated by ChEMBL
LigandPNGBDBM50130669(CHEMBL3634614 | US10329295, Example 35)
Affinity DataIC50:  1nM. Assay description: Inhibition of IRAK4 (unknown origin)
In DepthDetails ArticlePubMed