BDBM50130678 CHEMBL3634380
SMILES Cn1cc(NC(=O)c2csc3ncc(N[C@@H]4CCCC[C@@H]4N)nc23)c(n1)C(F)(F)F
InChI Key InChIKey=VROISVCBZLCKGS-WDEREUQCSA-N
Data  2 IC50
  Tab Delimited (TSV)   2D SDfile   Computed 3D by Vconf -m prep SDfile
Find this compound or compounds like it in BindingDB:
Activity Spreadsheet -- Enzyme Inhibition Constant Data from BindingDB
Found 2 hits for monomerid = 50130678
TargetInterleukin-1 receptor-associated kinase 4(Homo sapiens (Human))
Merck Research Laboratories
Curated by ChEMBL
LigandPNGBDBM50130678(CHEMBL3634380)
Affinity DataIC50:  20nM. Assay description: Inhibition of IRAK4 in human PBMC
In DepthDetails ArticlePubMed
TargetInterleukin-1 receptor-associated kinase 4(Homo sapiens (Human))
Merck Research Laboratories
Curated by ChEMBL
LigandPNGBDBM50130678(CHEMBL3634380)
Affinity DataIC50:  1nM. Assay description: Inhibition of IRAK4 (unknown origin)
In DepthDetails ArticlePubMed