BDBM50131254 (S)-5-Guanidino-2-{(S)-2-[(S)-3-(3H-imidazol-4-yl)-2-(2-methoxy-acetylamino)-propionylamino]-3-phenyl-propionylamino}-pentanoic acid [(S)-1-carbamoyl-2-(1H-indol-3-yl)-ethyl]-amide::CHEMBL315258
SMILES COCC(=O)N[C@@H](Cc1cnc[nH]1)C(=O)N[C@@H](Cc1ccccc1)C(=O)N[C@@H](CCCNC(N)=N)C(=O)N[C@@H](Cc1c[nH]c2ccccc12)C(N)=O
InChI Key InChIKey=SOPYHFQNBMKJEU-DZUOILHNSA-N
Data  3 KI  3 EC50
  Tab Delimited (TSV)   2D SDfile   Computed 3D by Vconf -m prep SDfile
Find this compound or compounds like it in BindingDB:
Activity Spreadsheet -- Enzyme Inhibition Constant Data from BindingDB
Found 6 hits for monomerid = 50131254
TargetMelanocyte-stimulating hormone receptor(Homo sapiens (Human))
University Of Cincinnati
Curated by ChEMBL
LigandPNGBDBM50131254((S)-5-Guanidino-2-{(S)-2-[(S)-3-(3H-imidazol-4-yl)...)
Affinity DataKi:  92nM. Assay description: Binding affinity towards human Melanocortin 1 receptor (hMC1R)
In DepthDetails ArticlePubMed
TargetMelanocortin receptor 4(Homo sapiens (Human))
University Of Cincinnati
Curated by ChEMBL
LigandPNGBDBM50131254((S)-5-Guanidino-2-{(S)-2-[(S)-3-(3H-imidazol-4-yl)...)
Affinity DataKi:  350nM. Assay description: Binding affinity towards human melanocortin 4 receptor (hMC4R)
In DepthDetails ArticlePubMed
TargetMelanocortin receptor 3(Homo sapiens (Human))
University Of Cincinnati
Curated by ChEMBL
LigandPNGBDBM50131254((S)-5-Guanidino-2-{(S)-2-[(S)-3-(3H-imidazol-4-yl)...)
Affinity DataKi:  380nM. Assay description: Binding affinity towards human Melanocortin 3 receptor (hMC3R)
In DepthDetails ArticlePubMed
TargetMelanocortin receptor 4(Homo sapiens (Human))
University Of Cincinnati
Curated by ChEMBL
LigandPNGBDBM50131254((S)-5-Guanidino-2-{(S)-2-[(S)-3-(3H-imidazol-4-yl)...)
Affinity DataEC50:  43nM. Assay description: In vitro agonist potency was evaluated in HEK293 cells transfected with human melanocortin receptor (hMC3R)
In DepthDetails ArticlePubMed
TargetMelanocyte-stimulating hormone receptor(Homo sapiens (Human))
University Of Cincinnati
Curated by ChEMBL
LigandPNGBDBM50131254((S)-5-Guanidino-2-{(S)-2-[(S)-3-(3H-imidazol-4-yl)...)
Affinity DataEC50:  9.5nM. Assay description: Binding affinity towards human Melanocortin 3 receptor (hMC3R)
In DepthDetails ArticlePubMed
TargetMelanocortin receptor 3(Homo sapiens (Human))
University Of Cincinnati
Curated by ChEMBL
LigandPNGBDBM50131254((S)-5-Guanidino-2-{(S)-2-[(S)-3-(3H-imidazol-4-yl)...)
Affinity DataEC50:  570nM. Assay description: Binding affinity towards human Melanocortin 3 receptor (hMC3R)
In DepthDetails ArticlePubMed