BDBM50131710 5-Chloro-4-[4-(2,3-dihydro-benzo[1,4]dioxin-2-ylmethyl)-piperazin-1-yl]-2-{7-[4-(2-ethoxy-phenyl)-piperazin-1-yl]-heptyl}-2H-pyridazin-3-one::CHEMBL264731
SMILES CCOc1ccccc1N1CCN(CCCCCCCn2ncc(Cl)c(N3CCN(CC4COc5ccccc5O4)CC3)c2=O)CC1
InChI Key InChIKey=PCDOWAYMDIDVIY-UHFFFAOYSA-N
Data  1 KI
  Tab Delimited (TSV)   2D SDfile   Computed 3D by Vconf -m prep SDfile
Find this compound or compounds like it in BindingDB:
Activity Spreadsheet -- Enzyme Inhibition Constant Data from BindingDB
Found 1 hit for monomerid = 50131710
Target5-hydroxytryptamine receptor 1A(Rattus norvegicus (rat))
Università
Curated by ChEMBL
LigandPNGBDBM50131710(5-Chloro-4-[4-(2,3-dihydro-benzo[1,4]dioxin-2-ylme...)
Affinity DataKi:  1.02nM. Assay description: Displacement of [3H]-8-OH-DPAT from 5-hydroxytryptamine 1A receptor of rat cortex membranes
In DepthDetails ArticlePubMed