BDBM50131857 CHEMBL3633364
SMILES N[C@@H](CSC1(c2ccccc2)c2ccccc2CCc2ccccc12)C(O)=O
InChI Key InChIKey=MGXXIAGFVCXNGK-QFIPXVFZSA-N
Data  1 IC50
  Tab Delimited (TSV)   2D SDfile   Computed 3D by Vconf -m prep SDfile
Find this compound or compounds like it in BindingDB:
Activity Spreadsheet -- Enzyme Inhibition Constant Data from BindingDB
Found 1 hit for monomerid = 50131857
TargetKinesin-like protein KIF11(Homo sapiens (Human))
University Of Shizuoka
Curated by ChEMBL
LigandPNGBDBM50131857(CHEMBL3633364)
Affinity DataIC50:  209nM. Assay description: Binding affinity against delta opioid receptor in mouse hot plate test
In DepthDetails ArticlePubMed