BDBM50132227 4-(7-Ethoxy-6-methoxy-quinazolin-4-yl)-piperazine-1-carbothioic acid benzylamide::CHEMBL103490
SMILES CCOc1cc2ncnc(N3CCN(CC3)C(=S)NCc3ccccc3)c2cc1OC
InChI Key InChIKey=WGDQJKQQPFXRBI-UHFFFAOYSA-N
Data  2 IC50
  Tab Delimited (TSV)   2D SDfile   Computed 3D by Vconf -m prep SDfile
Find this compound or compounds like it in BindingDB:
Activity Spreadsheet -- Enzyme Inhibition Constant Data from BindingDB
Found 2 hits for monomerid = 50132227
TargetPlatelet-derived growth factor receptor beta(Homo sapiens (Human))
Pharmaceutical Research Institute
Curated by ChEMBL
LigandPNGBDBM50132227(4-(7-Ethoxy-6-methoxy-quinazolin-4-yl)-piperazine-...)
Affinity DataIC50:  150nM. Assay description: Inhibition of platelet-derived growth factor receptor beta phosphorylation was measured in intact cells using a two-site enzyme linked immunosorbent ...
In DepthDetails ArticlePubMed
TargetPlatelet-derived growth factor receptor beta(Homo sapiens (Human))
Pharmaceutical Research Institute
Curated by ChEMBL
LigandPNGBDBM50132227(4-(7-Ethoxy-6-methoxy-quinazolin-4-yl)-piperazine-...)
Affinity DataIC50:  150nM. Assay description: Inhibitory concentration against platelet-derived growth factor receptor beta phosphorylation in CHO cells
In DepthDetails ArticlePubMed