BDBM50133248 CHEMBL134413::Dodecanedioic acid 4-(2-hydroxymethyl-4-isopropyl-5-oxo-pyrrolidin-3-yl)-naphthalen-1-yl ester naphthalen 4-(2-hydroxymethyl-4-isopropyl-5-oxo-pyrrolidin-3-yl)-1-yl ester
SMILES CC(C)[C@@H]1C([C@@H](CO)NC1=O)c1ccc(OC(=O)CCCCCCCCCCC(=O)Oc2ccc([C@@H]3[C@@H](CO)NC(=O)[C@@H]3C(C)C)c3ccccc23)c2ccccc12
InChI Key InChIKey=VZLIKMVDZRJBSV-HUJYFTBVSA-N
Data  2 KI
  Tab Delimited (TSV)   2D SDfile   Computed 3D by Vconf -m prep SDfile
Find this compound or compounds like it in BindingDB:
Activity Spreadsheet -- Enzyme Inhibition Constant Data from BindingDB
Found 2 hits for monomerid = 50133248
TargetProtein kinase C delta type(Mus musculus)
Georgetown University Medical Center
Curated by ChEMBL
LigandPNGBDBM50133248(CHEMBL134413 | Dodecanedioic acid 4-(2-hydroxymeth...)
Affinity DataKi:  45nM. Assay description: Tested for ability to displace [20e3] phorbol 12,13- dibutyrate binding from recombinant murine Protein kinase C delta in presence of [Ca2+]
In DepthDetails ArticlePubMed
TargetProtein kinase C alpha type(Bos taurus (bovine))
Georgetown University Medical Center
Curated by ChEMBL
LigandPNGBDBM50133248(CHEMBL134413 | Dodecanedioic acid 4-(2-hydroxymeth...)
Affinity DataKi:  169nM. Assay description: Tested for ability to displace [20e3] phorbol 12,13- dibutyrate binding from recombinant bovine Protein kinase C alpha in presence of [Ca2+]
In DepthDetails ArticlePubMed