BDBM50133273 Ac-Nle4-c[Asp5,D-Phe(pI)7,Lys10]R-MSH(4-10)-NH2::CHEMBL440801
SMILES CCCC[C@H](NC(C)=O)C(=O)N[C@@H]1CC(=O)NCCCC[C@H](NC(=O)[C@H](Cc2c[nH]c3ccccc23)NC(=O)[C@@H](CCCNC(N)=N)NC(=O)[C@@H](Cc2ccc(I)cc2)NC(=O)[C@@H](Cc2cnc[nH]2)NC1=O)C(N)=O
InChI Key InChIKey=NVIBFTUPAARCBA-JWTSGICISA-N
Data  1 EC50
  Tab Delimited (TSV)   2D SDfile   Computed 3D by Vconf -m prep SDfile
Find this compound or compounds like it in BindingDB:
Activity Spreadsheet -- Enzyme Inhibition Constant Data from BindingDB
Found 1 hit for monomerid = 50133273
TargetMelanocyte-stimulating hormone receptor(Homo sapiens (Human))
University Of Arizona
Curated by ChEMBL
LigandPNGBDBM50133273(Ac-Nle4-c[Asp5,D-Phe(pI)7,Lys10]R-MSH(4-10)-NH2 | ...)
Affinity DataEC50:  0.0550nM. Assay description: Effective concentration required for the biological activity against human Melanocortin 1 receptor
In DepthDetails ArticlePubMed