BDBM50133823 4-(3-Chloro-pyridin-2-yl)-piperazine-1-carboxylic acid (4-butyl-phenyl)-amide::CHEMBL120875
SMILES CCCCc1ccc(NC(=O)N2CCN(CC2)c2ncccc2Cl)cc1
InChI Key InChIKey=HIMBHVCRVXEWJU-UHFFFAOYSA-N
Data  2 IC50
  Tab Delimited (TSV)   2D SDfile   Computed 3D by Vconf -m prep SDfile
Find this compound or compounds like it in BindingDB:
Activity Spreadsheet -- Enzyme Inhibition Constant Data from BindingDB
Found 2 hits for monomerid = 50133823
TargetTransient receptor potential cation channel subfamily V member 1(Rattus norvegicus (rat))
Purdue Pharma
Curated by ChEMBL
LigandPNGBDBM50133823(4-(3-Chloro-pyridin-2-yl)-piperazine-1-carboxylic ...)
Affinity DataIC50:  203nM. Assay description: Vanilloid receptor subtype 1 antagonist activity based on its ability to block capsaicin-induced (CAP) activation of the rat VR1 channel in a HEK293 ...
In DepthDetails ArticlePubMed
TargetTransient receptor potential cation channel subfamily V member 1(Rattus norvegicus (rat))
Purdue Pharma
Curated by ChEMBL
LigandPNGBDBM50133823(4-(3-Chloro-pyridin-2-yl)-piperazine-1-carboxylic ...)
Affinity DataIC50:  117nM. Assay description: Vanilloid receptor subtype 1 antagonist activity based on its ability to block capsaicin-induced (CAP) activation of the rat VR1 channel in a HEK293 ...
In DepthDetails ArticlePubMed