BDBM50133960 (S)-2-((3aS,6S,6aR)-4-Cyclopropanecarbonyl-6-methyl-5-oxo-hexahydro-pyrrolo[3,2-b]pyrrole-1-carbonyl)-pyrrolidine-1-carboxylic acid (4-isopropyl-phenyl)-amide::CHEMBL344039
SMILES CC(C)c1ccc(NC(=O)N2CCC[C@H]2C(=O)N2CC[C@H]3[C@H]2[C@H](C)C(=O)N3C(=O)C2CC2)cc1
InChI Key InChIKey=MALRJMNEGMUHCT-IRNNPGBSSA-N
Data  1 KI  1 IC50
  Tab Delimited (TSV)   2D SDfile   Computed 3D by Vconf -m prep SDfile
Find this compound or compounds like it in BindingDB:
Activity Spreadsheet -- Enzyme Inhibition Constant Data from BindingDB
Found 2 hits for monomerid = 50133960
TargetCapsid scaffolding protein(Human cytomegalovirus (strain AD169) (HHV-5) (Huma...)
Glaxosmithkline
Curated by ChEMBL
LigandPNGBDBM50133960((S)-2-((3aS,6S,6aR)-4-Cyclopropanecarbonyl-6-methy...)
Affinity DataKi:  2nM. Assay description: Potency against human cytomegalovirus protease in HCMV pNA assay
In DepthDetails ArticlePubMed
TargetCapsid scaffolding protein(Human cytomegalovirus (strain AD169) (HHV-5) (Huma...)
Glaxosmithkline
Curated by ChEMBL
LigandPNGBDBM50133960((S)-2-((3aS,6S,6aR)-4-Cyclopropanecarbonyl-6-methy...)
Affinity DataIC50:  200nM. Assay description: Inhibition of human cytomegalovirus protease in HCMV pNA assay.
In DepthDetails ArticlePubMed