BDBM50133988 (3S,3aR,6aS)-1-(Cyclopropylcarbonyl)-3-methyl-4-{[(2S)-1-(2-naphthylsulfonyl)pyrrolidin-2-yl]carbonyl}-hexahydropyrrolo[3,2-b]pyrrol-2(1H)-one::(3S,3aR,6aS)-1-Cyclopropanecarbonyl-3-methyl-4-[(S)-1-(naphthalene-2-sulfonyl)-pyrrolidine-2-carbonyl]-hexahydro-pyrrolo[3,2-b]pyrrol-2-one::CHEMBL342043
SMILES C[C@H]1[C@@H]2[C@H](CCN2C(=O)[C@@H]2CCCN2S(=O)(=O)c2ccc3ccccc3c2)N(C(=O)C2CC2)C1=O
InChI Key InChIKey=HSRWYGGWAMAASX-YMPRXVIZSA-N
Data  1 KI  1 IC50
  Tab Delimited (TSV)   2D SDfile   Computed 3D by Vconf -m prep SDfile
Find this compound or compounds like it in BindingDB:
Activity Spreadsheet -- Enzyme Inhibition Constant Data from BindingDB
Found 2 hits for monomerid = 50133988
TargetCapsid scaffolding protein(Human cytomegalovirus (strain AD169) (HHV-5) (Huma...)
Glaxosmithkline
Curated by ChEMBL
LigandPNGBDBM50133988((3S,3aR,6aS)-1-(Cyclopropylcarbonyl)-3-methyl-4-{[...)
Affinity DataKi:  40nM. Assay description: Potency against human cytomegalovirus protease in HCMV pNA assay
In DepthDetails ArticlePubMed
TargetCapsid scaffolding protein(Human cytomegalovirus (strain AD169) (HHV-5) (Huma...)
Glaxosmithkline
Curated by ChEMBL
LigandPNGBDBM50133988((3S,3aR,6aS)-1-(Cyclopropylcarbonyl)-3-methyl-4-{[...)
Affinity DataIC50: <190nM. Assay description: Inhibition of human cytomegalovirus protease in HCMV pNA assay.
In DepthDetails ArticlePubMed