BDBM50134200 CHEMBL3735405
SMILES NCC[C@H](NC(=O)CNC(=O)Nc1ccc2n(Cc3c(Cl)cccc3Cl)cc(CN3CCCC3)c2c1)C(=O)N[C@H](Cc1ccccc1)C(=O)Nc1ccccc1
InChI Key InChIKey=AEPYHZVGPHKQKE-PQQNNWGCSA-N
Data  1 KI
  Tab Delimited (TSV)   2D SDfile   Computed 3D by Vconf -m prep SDfile
Find this compound or compounds like it in BindingDB:
Activity Spreadsheet -- Enzyme Inhibition Constant Data from BindingDB
Found 1 hit for monomerid = 50134200
TargetProteinase-activated receptor 2(Homo sapiens (Human))
Yonsei University
Curated by ChEMBL
LigandPNGBDBM50134200(CHEMBL3735405)
Affinity DataKi:  1.94E+3nM. Assay description: Displacement of [3H]furoyl-LIGRL-NH2 from human protease-activated receptor 2 in NCTC-2544 cells
In DepthDetails ArticlePubMed