BDBM50135049 2-Amino-3-methyl-pentanoic acid diethylamide::CHEMBL146437
SMILES CCC(C)C(N)C(=O)N(CC)CC
InChI Key InChIKey=QLDBICAEGOTPTI-UHFFFAOYSA-N
Data  2 IC50
  Tab Delimited (TSV)   2D SDfile   Computed 3D by Vconf -m prep SDfile
Find this compound or compounds like it in BindingDB:
Activity Spreadsheet -- Enzyme Inhibition Constant Data from BindingDB
Found 2 hits for monomerid = 50135049
TargetDipeptidyl peptidase 2(Homo sapiens (Human))
University Of Antwerp (Uia)
Curated by ChEMBL
LigandPNGBDBM50135049(2-Amino-3-methyl-pentanoic acid diethylamide | CHE...)
Affinity DataIC50: >5.00E+5nM. Assay description: Inhibitory activity of compound against Dipeptidylpeptidase II (DPP II)
In DepthDetails ArticlePubMed
TargetDipeptidyl peptidase 4(Homo sapiens (Human))
University Of Antwerp (Uia)
Curated by ChEMBL
LigandPNGBDBM50135049(2-Amino-3-methyl-pentanoic acid diethylamide | CHE...)
Affinity DataIC50: >5.00E+5nM. Assay description: Inhibitory activity against Dipeptidylpeptidase IV (DPP IV)
In DepthDetails ArticlePubMed