BDBM50135412 CHEMBL423331::N-((S)-1-Ethyl-pyrrolidin-2-ylmethyl)-6-hydroxy-3-iodo-2-methoxy-benzamide
SMILES CCN1CCC[C@H]1CNC(=O)c1c(O)ccc(I)c1OC
InChI Key InChIKey=FKOZYIIIHDNKFQ-JTQLQIEISA-N
Data  2 IC50
  Tab Delimited (TSV)   2D SDfile   Computed 3D by Vconf -m prep SDfile
Find this compound or compounds like it in BindingDB:
Activity Spreadsheet -- Enzyme Inhibition Constant Data from BindingDB
Found 2 hits for monomerid = 50135412
TargetD(2) dopamine receptor(Rattus norvegicus (rat))
Yale University
Curated by ChEMBL
LigandPNGBDBM50135412(CHEMBL423331 | N-((S)-1-Ethyl-pyrrolidin-2-ylmethy...)
Affinity DataIC50:  196nM. Assay description: In vivo inhibitory activity of the compound against dopamine (D2) receptor in rat caudate-putamen tissue
In DepthDetails ArticlePubMed
TargetD(1A) dopamine receptor(RAT)
Yale University
Curated by ChEMBL
LigandPNGBDBM50135412(CHEMBL423331 | N-((S)-1-Ethyl-pyrrolidin-2-ylmethy...)
Affinity DataIC50: >1.00E+4nM. Assay description: In vivo inhibitory activity of the compound against dopamine (D1) receptor in rat caudate-putamen tissue
In DepthDetails ArticlePubMed