BDBM50135617 3-(5-Sulfamoyl-[1,3,4]thiadiazol-2-ylsulfamoyl)-benzoic acid 2-(2-dimethylamino-ethoxy)-ethyl ester::CHEMBL99257
SMILES CN(C)CCOCCOC(=O)c1cccc(c1)S(=O)(=O)Nc1nnc(s1)S(N)(=O)=O
InChI Key InChIKey=VICPJUSXWWJNBZ-UHFFFAOYSA-N
Data  3 KI
  Tab Delimited (TSV)   2D SDfile   Computed 3D by Vconf -m prep SDfile
Find this compound or compounds like it in BindingDB:
Activity Spreadsheet -- Enzyme Inhibition Constant Data from BindingDB
Found 3 hits for monomerid = 50135617
TargetCarbonic anhydrase 2(Homo sapiens (Human))
Universit£
Curated by ChEMBL
LigandPNGBDBM50135617(3-(5-Sulfamoyl-[1,3,4]thiadiazol-2-ylsulfamoyl)-be...)
Affinity DataKi:  1.60nM. Assay description: Inhibitory activity against human carbonic anhydrase II
In DepthDetails ArticlePubMed
TargetCarbonic anhydrase 4(Bos taurus (bovine))
Universit£
Curated by ChEMBL
LigandPNGBDBM50135617(3-(5-Sulfamoyl-[1,3,4]thiadiazol-2-ylsulfamoyl)-be...)
Affinity DataKi:  6nM. Assay description: Inhibitory activity against Carbonic anhydrase IV isolated from bovine lung
In DepthDetails ArticlePubMed
TargetCarbonic anhydrase 1(Homo sapiens (Human))
Universit£
Curated by ChEMBL
LigandPNGBDBM50135617(3-(5-Sulfamoyl-[1,3,4]thiadiazol-2-ylsulfamoyl)-be...)
Affinity DataKi:  13nM. Assay description: Inhibitory activity against human carbonic anhydrase I (hCA I)
In DepthDetails ArticlePubMed