BDBM50135849 2,3,4-trichloro-6-(3,4,5-trichloro-2-hydroxyphenoxy)phenol::CHEMBL150198
SMILES Oc1c(Oc2cc(Cl)c(Cl)c(Cl)c2O)cc(Cl)c(Cl)c1Cl
InChI Key InChIKey=UAHVJTGPSLMIDJ-UHFFFAOYSA-N
Data  1 IC50
  Tab Delimited (TSV)   2D SDfile   Computed 3D by Vconf -m prep SDfile
Find this compound or compounds like it in BindingDB:
Activity Spreadsheet -- Enzyme Inhibition Constant Data from BindingDB
Found 1 hit for monomerid = 50135849
TargetAldo-keto reductase family 1 member B1(Homo sapiens (Human))
Instituto Biomar
Curated by ChEMBL
LigandPNGBDBM50135849(2,3,4-trichloro-6-(3,4,5-trichloro-2-hydroxyphenox...)
Affinity DataIC50:  3.20E+3nM. Assay description: In vitro inhibitory activity against recombinant human aldose reductase (ALR2) was determined
In DepthDetails ArticlePubMed