BDBM50135852 2,3,4-tribromo-6-(3,4-dibromo-5-fluoro-2-hydroxyphenoxy)phenol::CHEMBL414496
SMILES Oc1c(Br)c(Br)c(F)cc1Oc1cc(Br)c(Br)c(Br)c1O
InChI Key InChIKey=OYOQNBUNNOQZQP-UHFFFAOYSA-N
Data  1 IC50
  Tab Delimited (TSV)   2D SDfile   Computed 3D by Vconf -m prep SDfile
Find this compound or compounds like it in BindingDB:
Activity Spreadsheet -- Enzyme Inhibition Constant Data from BindingDB
Found 1 hit for monomerid = 50135852
TargetAldo-keto reductase family 1 member B1(Homo sapiens (Human))
Instituto Biomar
Curated by ChEMBL
LigandPNGBDBM50135852(2,3,4-tribromo-6-(3,4-dibromo-5-fluoro-2-hydroxyph...)
Affinity DataIC50:  3.20E+3nM. Assay description: In vitro inhibitory activity against recombinant human aldose reductase (ALR2) was determined
In DepthDetails ArticlePubMed