BDBM50135853 2,3,4-tribromo-6-(3,4,5-tribromo-2-hydroxyphenoxy)phenol::CHEMBL151952
SMILES Oc1c(Oc2cc(Br)c(Br)c(Br)c2O)cc(Br)c(Br)c1Br
InChI Key InChIKey=AUJSEOPMWKDXKM-UHFFFAOYSA-N
Data  1 IC50
  Tab Delimited (TSV)   2D SDfile   Computed 3D by Vconf -m prep SDfile
Find this compound or compounds like it in BindingDB:
Activity Spreadsheet -- Enzyme Inhibition Constant Data from BindingDB
Found 1 hit for monomerid = 50135853
TargetAldo-keto reductase family 1 member B1(Homo sapiens (Human))
Instituto Biomar
Curated by ChEMBL
LigandPNGBDBM50135853(2,3,4-tribromo-6-(3,4,5-tribromo-2-hydroxyphenoxy)...)
Affinity DataIC50:  5.70E+3nM. Assay description: In vitro inhibitory activity against recombinant human aldose reductase (ALR2) was determined
In DepthDetails ArticlePubMed