BDBM50135856 6-(2-Amino-3,4,5-tribromo-phenoxy)-2,3,4-tribromo-phenol::CHEMBL148918
SMILES Nc1c(Br)c(Br)c(Br)cc1Oc1cc(Br)c(Br)c(Br)c1O
InChI Key InChIKey=FTLDRYVWCIPFPB-UHFFFAOYSA-N
Data  1 IC50
  Tab Delimited (TSV)   2D SDfile   Computed 3D by Vconf -m prep SDfile
Find this compound or compounds like it in BindingDB:
Activity Spreadsheet -- Enzyme Inhibition Constant Data from BindingDB
Found 1 hit for monomerid = 50135856
TargetAldo-keto reductase family 1 member B1(Homo sapiens (Human))
Instituto Biomar
Curated by ChEMBL
LigandPNGBDBM50135856(6-(2-Amino-3,4,5-tribromo-phenoxy)-2,3,4-tribromo-...)
Affinity DataIC50:  8.90E+3nM. Assay description: In vitro inhibitory activity against recombinant human aldose reductase (ALR2) was determined
In DepthDetails ArticlePubMed