BDBM50135862 CHEMBL3751881
SMILES [H][C@@]12CCC(=O)[C@@]1(C)CC[C@@]1([H])[C@@]2([H])C[C@H](C)C2=CCCC[C@]12C
InChI Key InChIKey=SPQYFKZBWJXPTC-KYOGTECMSA-N
Data  1 KI  1 IC50
  Tab Delimited (TSV)   2D SDfile   Computed 3D by Vconf -m prep SDfile
Find this compound or compounds like it in BindingDB:
Activity Spreadsheet -- Enzyme Inhibition Constant Data from BindingDB
Found 2 hits for monomerid = 50135862
TargetAromatase(Homo sapiens (Human))
The M. S. University Of Baroda
Curated by ChEMBL
LigandPNGBDBM50135862(CHEMBL3751881)
Affinity DataKi:  3.10nM. Assay description: Competitive inhibition of human aromatase extracted from placental microsomes after 5 mins by Dixon plot analysis in presence of [1beta-3H]AD
In DepthDetails ArticlePubMed
TargetAromatase(Homo sapiens (Human))
The M. S. University Of Baroda
Curated by ChEMBL
LigandPNGBDBM50135862(CHEMBL3751881)
Affinity DataIC50:  170nM. Assay description: Inhibition of human placental microsome aromatase using [1beta3H]-androstenedione as substrate measured after 15 mins in presence of NADPH by liquid ...
In DepthDetails ArticlePubMed