BDBM50135904 7-(4-Dimethylamino-phenyl)-5,6-bis-(4-isopropyl-phenyl)-pyrido[2,3-d]pyrimidin-4-ylamine::CHEMBL151079
SMILES CC(C)c1ccc(cc1)-c1c(nc2ncnc(N)c2c1-c1ccc(cc1)C(C)C)-c1ccc(cc1)N(C)C
InChI Key InChIKey=XRMDQDPTBZOBAD-UHFFFAOYSA-N
Data  2 IC50
  Tab Delimited (TSV)   2D SDfile   Computed 3D by Vconf -m prep SDfile
Find this compound or compounds like it in BindingDB:
Activity Spreadsheet -- Enzyme Inhibition Constant Data from BindingDB
Found 2 hits for monomerid = 50135904
TargetAdenosine kinase(Rattus norvegicus (rat))
Abbott Laboratories
Curated by ChEMBL
LigandPNGBDBM50135904(7-(4-Dimethylamino-phenyl)-5,6-bis-(4-isopropyl-ph...)
Affinity DataIC50:  6.70nM. Assay description: Inhibition adenosine kinase activity in rat brain in vitro
In DepthDetails ArticlePubMed
TargetAdenosine kinase(Homo sapiens (Human))
Abbott Laboratories
Curated by ChEMBL
LigandPNGBDBM50135904(7-(4-Dimethylamino-phenyl)-5,6-bis-(4-isopropyl-ph...)
Affinity DataIC50: >1.00E+3nM. Assay description: Inhibition of adenosine kinase activity in IMR-32 human neuroblastoma cells
In DepthDetails ArticlePubMed