BDBM50135918 CHEMBL3753803
SMILES [H][C@@]12CCC(=O)[C@@]1(C)CC[C@@]1([H])[C@@]2([H])C=C(CCC)C2=CC(=O)C=C[C@]12C
InChI Key InChIKey=LKOTWAQBXMBDFM-BDCMKUQMSA-N
Data  1 KI
  Tab Delimited (TSV)   2D SDfile   Computed 3D by Vconf -m prep SDfile
Find this compound or compounds like it in BindingDB:
Activity Spreadsheet -- Enzyme Inhibition Constant Data from BindingDB
Found 1 hit for monomerid = 50135918
TargetAromatase(Homo sapiens (Human))
The M. S. University Of Baroda
Curated by ChEMBL
LigandPNGBDBM50135918(CHEMBL3753803)
Affinity DataKi:  2.5nM. Assay description: Competitive inhibition of human aromatase extracted from placental microsomes after 5 mins by Dixon plot analysis in presence of [1beta-3H]AD
In DepthDetails ArticlePubMed