BDBM50135920 2-Amino-7-(3-hydroxy-4-hydroxymethyl-pyrrolidin-1-ylmethyl)-5H-pyrrolo[3,2-d]pyrimidin-4-ol::CHEMBL435085
SMILES Nc1nc2c(CN3CC(O)[C@@H](CO)C3)c[nH]c2c(=O)[nH]1
InChI Key InChIKey=GSPTUGDLYPMLCQ-GVHYBUMESA-N
Data  2 KI
  Tab Delimited (TSV)   2D SDfile   Computed 3D by Vconf -m prep SDfile
Find this compound or compounds like it in BindingDB:
Activity Spreadsheet -- Enzyme Inhibition Constant Data from BindingDB
Found 2 hits for monomerid = 50135920
TargetPurine nucleoside phosphorylase(Homo sapiens (Human))
Industrial Research
Curated by ChEMBL
LigandPNGBDBM50135920(2-Amino-7-(3-hydroxy-4-hydroxymethyl-pyrrolidin-1-...)
Affinity DataKi:  0.00680nM. Assay description: Dissociation constant against Human Purine Nucleoside Phosphorylase was reported
In DepthDetails ArticlePubMed
TargetPurine nucleoside phosphorylase(Homo sapiens (Human))
Industrial Research
Curated by ChEMBL
LigandPNGBDBM50135920(2-Amino-7-(3-hydroxy-4-hydroxymethyl-pyrrolidin-1-...)
Affinity DataKi:  0.163nM. Assay description: Binding affinity towards Human Purine Nucleoside Phosphorylase was reported
In DepthDetails ArticlePubMed