BDBM50135958 2-[2-(3-Amino-propyl)-phenyl]-5-trifluoromethyl-2H-pyrazole-3-carboxylic acid (3-fluoro-2'-methanesulfonyl-biphenyl-4-yl)-amide::CHEMBL343472
SMILES CS(=O)(=O)c1ccccc1-c1ccc(NC(=O)c2cc(nn2-c2ccccc2CCCN)C(F)(F)F)c(F)c1
InChI Key InChIKey=ILARVNIFBRWOQW-UHFFFAOYSA-N
Data  2 KI
  Tab Delimited (TSV)   2D SDfile   Computed 3D by Vconf -m prep SDfile
Find this compound or compounds like it in BindingDB:
Activity Spreadsheet -- Enzyme Inhibition Constant Data from BindingDB
Found 2 hits for monomerid = 50135958
TargetCoagulation factor X(Homo sapiens (Human))
Pharmaceutical Research Institute
Curated by ChEMBL
LigandPNGBDBM50135958(2-[2-(3-Amino-propyl)-phenyl]-5-trifluoromethyl-2H...)
Affinity DataKi:  600nM. Assay description: Tested in vitro for inhibition of human Coagulation factor X
In DepthDetails ArticlePubMed
TargetProthrombin(Homo sapiens (Human))
Pharmaceutical Research Institute
Curated by ChEMBL
LigandPNGBDBM50135958(2-[2-(3-Amino-propyl)-phenyl]-5-trifluoromethyl-2H...)
Affinity DataKi: >2.10E+4nM. Assay description: In vitro for inhibition of human thrombin
In DepthDetails ArticlePubMed