BDBM50135959 2-(4-Methoxy-phenyl)-5-trifluoromethyl-2H-pyrazole-3-carboxylic acid (2'-sulfamoyl-biphenyl-4-yl)-amide::CHEMBL149583
SMILES COc1ccc(cc1)-n1nc(cc1C(=O)Nc1ccc(cc1)-c1ccccc1S(N)(=O)=O)C(F)(F)F
InChI Key InChIKey=IKKTVWCKRXZHRN-UHFFFAOYSA-N
Data  3 KI
  Tab Delimited (TSV)   2D SDfile   Computed 3D by Vconf -m prep SDfile
Find this compound or compounds like it in BindingDB:
Activity Spreadsheet -- Enzyme Inhibition Constant Data from BindingDB
Found 3 hits for monomerid = 50135959
TargetCoagulation factor X(Homo sapiens (Human))
Pharmaceutical Research Institute
Curated by ChEMBL
LigandPNGBDBM50135959(2-(4-Methoxy-phenyl)-5-trifluoromethyl-2H-pyrazole...)
Affinity DataKi:  3.5nM. Assay description: Tested in vitro for inhibition of human Coagulation factor X
In DepthDetails ArticlePubMed
TargetSerine protease 1(Homo sapiens (Human))
Pharmaceutical Research Institute
Curated by ChEMBL
LigandPNGBDBM50135959(2-(4-Methoxy-phenyl)-5-trifluoromethyl-2H-pyrazole...)
Affinity DataKi: >1.50E+3nM. Assay description: Tested in vitro for inhibition of human trypsin
In DepthDetails ArticlePubMed
TargetProthrombin(Homo sapiens (Human))
Pharmaceutical Research Institute
Curated by ChEMBL
LigandPNGBDBM50135959(2-(4-Methoxy-phenyl)-5-trifluoromethyl-2H-pyrazole...)
Affinity DataKi: >2.10E+4nM. Assay description: In vitro for inhibition of human thrombin
In DepthDetails ArticlePubMed