BDBM50136080 CHEMBL154865::Sulfamic acid 4-methyl-benzyl ester
SMILES Cc1ccc(COS(N)(=O)=O)cc1
InChI Key InChIKey=HLXZJWIQXIKPRD-UHFFFAOYSA-N
Data  3 KI
  Tab Delimited (TSV)   2D SDfile   Computed 3D by Vconf -m prep SDfile
Find this compound or compounds like it in BindingDB:
Activity Spreadsheet -- Enzyme Inhibition Constant Data from BindingDB
Found 3 hits for monomerid = 50136080
TargetCarbonic anhydrase 2(Homo sapiens (Human))
University Of Montpellier
Curated by ChEMBL
LigandPNGBDBM50136080(CHEMBL154865 | Sulfamic acid 4-methyl-benzyl ester)
Affinity DataKi:  2.70nM. Assay description: Inhibitory activity against human carbonic anhydrase II.
In DepthDetails ArticlePubMed
TargetCarbonic anhydrase 9(Homo sapiens (Human))
University Of Montpellier
Curated by ChEMBL
LigandPNGBDBM50136080(CHEMBL154865 | Sulfamic acid 4-methyl-benzyl ester)
Affinity DataKi:  13nM. Assay description: Inhibitory activity against human carbonic anhydrase IX.
In DepthDetails ArticlePubMed
TargetCarbonic anhydrase 1(Homo sapiens (Human))
University Of Montpellier
Curated by ChEMBL
LigandPNGBDBM50136080(CHEMBL154865 | Sulfamic acid 4-methyl-benzyl ester)
Affinity DataKi:  100nM. Assay description: Inhibitory activity against human carbonic anhydrase I.
In DepthDetails ArticlePubMed