BDBM50137030 2-(2-Amino-3-phenyl-propionylamino)-3-phenyl-propionic acid::2-[(2-ammonio-3-phenylpropanoyl)amino]-3-phenylpropanoate::CHEMBL422328
SMILES [NH3+]C(Cc1ccccc1)C(=O)NC(Cc1ccccc1)C([O-])=O
InChI Key InChIKey=GKZIWHRNKRBEOH-UHFFFAOYSA-N
Data  1 KI
  Tab Delimited (TSV)   2D SDfile   Computed 3D by Vconf -m prep SDfile
Find this compound or compounds like it in BindingDB:
Activity Spreadsheet -- Enzyme Inhibition Constant Data from BindingDB
Found 1 hit for monomerid = 50137030
TargetSolute carrier family 15 member 1(Homo sapiens (Human))
Martin-Luther-University Halle-Wittenberg
Curated by ChEMBL
LigandPNGBDBM50137030(2-(2-Amino-3-phenyl-propionylamino)-3-phenyl-propi...)
Affinity DataKi:  1.10E+5nM. Assay description: Inhibition constant (Ki) for human intestinal peptide carrier
In DepthDetails ArticlePubMed