BDBM50137410 2-[5-(4-Bromo-phenyl)-3-difluoromethyl-pyrazol-1-yl]-5-methanesulfonyl-pyridine::CHEMBL177397
SMILES CS(=O)(=O)c1ccc(nc1)-n1nc(cc1-c1ccc(Br)cc1)C(F)F
InChI Key InChIKey=AJIRASBZKXSTKY-UHFFFAOYSA-N
Data  2 IC50
  Tab Delimited (TSV)   2D SDfile   Computed 3D by Vconf -m prep SDfile
Find this compound or compounds like it in BindingDB:
Activity Spreadsheet -- Enzyme Inhibition Constant Data from BindingDB
Found 2 hits for monomerid = 50137410
TargetProstaglandin G/H synthase 2(Canis familiaris)
Pfizer
Curated by ChEMBL
LigandPNGBDBM50137410(2-[5-(4-Bromo-phenyl)-3-difluoromethyl-pyrazol-1-y...)
Affinity DataIC50:  290nM. Assay description: In vitro inhibitory activity against cannine prostaglandin G/H synthase 2.
In DepthDetails ArticlePubMed
TargetProstaglandin G/H synthase 1(Canis familiaris)
Pfizer
Curated by ChEMBL
LigandPNGBDBM50137410(2-[5-(4-Bromo-phenyl)-3-difluoromethyl-pyrazol-1-y...)
Affinity DataIC50:  1.00E+3nM. Assay description: In vitro inhibitory activity against cannine prostaglandin G/H synthase 1.
In DepthDetails ArticlePubMed