BDBM50137415 5-Methanesulfonyl-2-[5-(4-methoxy-3-methyl-phenyl)-3-trifluoromethyl-pyrazol-1-yl]-pyridine::CHEMBL176387
SMILES COc1ccc(cc1C)-c1cc(nn1-c1ccc(cn1)S(C)(=O)=O)C(F)(F)F
InChI Key InChIKey=ZWJUOYUYIQDUSS-UHFFFAOYSA-N
Data  2 IC50
  Tab Delimited (TSV)   2D SDfile   Computed 3D by Vconf -m prep SDfile
Find this compound or compounds like it in BindingDB:
Activity Spreadsheet -- Enzyme Inhibition Constant Data from BindingDB
Found 2 hits for monomerid = 50137415
TargetProstaglandin G/H synthase 2(Canis familiaris)
Pfizer
Curated by ChEMBL
LigandPNGBDBM50137415(5-Methanesulfonyl-2-[5-(4-methoxy-3-methyl-phenyl)...)
Affinity DataIC50:  270nM. Assay description: In vitro inhibitory activity against cannine prostaglandin G/H synthase 2.
In DepthDetails ArticlePubMed
TargetProstaglandin G/H synthase 1(Canis familiaris)
Pfizer
Curated by ChEMBL
LigandPNGBDBM50137415(5-Methanesulfonyl-2-[5-(4-methoxy-3-methyl-phenyl)...)
Affinity DataIC50:  4.07E+4nM. Assay description: In vitro inhibitory activity against cannine prostaglandin G/H synthase 1.
In DepthDetails ArticlePubMed