BDBM50137419 2-[5-(4-Bromo-phenyl)-3-trifluoromethyl-pyrazol-1-yl]-5-methanesulfonyl-pyridine::CHEMBL174586
SMILES CS(=O)(=O)c1ccc(nc1)-n1nc(cc1-c1ccc(Br)cc1)C(F)(F)F
InChI Key InChIKey=JRYCOLAIIGHRBC-UHFFFAOYSA-N
Data  2 IC50
  Tab Delimited (TSV)   2D SDfile   Computed 3D by Vconf -m prep SDfile
Find this compound or compounds like it in BindingDB:
Activity Spreadsheet -- Enzyme Inhibition Constant Data from BindingDB
Found 2 hits for monomerid = 50137419
TargetProstaglandin G/H synthase 2(Canis familiaris)
Pfizer
Curated by ChEMBL
LigandPNGBDBM50137419(2-[5-(4-Bromo-phenyl)-3-trifluoromethyl-pyrazol-1-...)
Affinity DataIC50:  450nM. Assay description: In vitro inhibitory activity against cannine prostaglandin G/H synthase 2.
In DepthDetails ArticlePubMed
TargetProstaglandin G/H synthase 1(Canis familiaris)
Pfizer
Curated by ChEMBL
LigandPNGBDBM50137419(2-[5-(4-Bromo-phenyl)-3-trifluoromethyl-pyrazol-1-...)
Affinity DataIC50:  2.86E+4nM. Assay description: In vitro inhibitory activity against cannine prostaglandin G/H synthase 1.
In DepthDetails ArticlePubMed