BDBM50137459 2-(5-Bromo-furan-2-yl)-1-cyclohexyl-1H-benzoimidazole-5-carboxylic acid::CHEMBL176034
SMILES OC(=O)c1ccc2n(C3CCCCC3)c(nc2c1)-c1ccc(Br)o1
InChI Key InChIKey=XXTJWYQPSKXGGB-UHFFFAOYSA-N
Data  1 IC50
  Tab Delimited (TSV)   2D SDfile   Computed 3D by Vconf -m prep SDfile
Find this compound or compounds like it in BindingDB:
Activity Spreadsheet -- Enzyme Inhibition Constant Data from BindingDB
Found 1 hit for monomerid = 50137459
TargetRNA-directed RNA polymerase(Hepatitis C virus)
Boehringer Ingelheim (Canada)
Curated by ChEMBL
LigandPNGBDBM50137459(2-(5-Bromo-furan-2-yl)-1-cyclohexyl-1H-benzoimidaz...)
Affinity DataIC50: >3.00E+4nM. Assay description: Inhibitory activity against NS5B polymerase of hepatitis C virus
In DepthDetails ArticlePubMed